Reaction Details
TargetOrexin/Hypocretin receptor type 1
LigandBDBM50133871
Substrate/Competitorn/a
Meas. Tech.ChEMBL_1526534 (CHEMBL3635422)
Ki 2287±n/a nM
Citation Behnke, DCotesta, SHintermann, SFendt, MGee, CEJacobson, LHLaue, GMeyer, AWagner, TBadiger, SChaudhari, VChebrolu, MPandit, CHoyer, DBetschart, C Discovery of 1H-pyrazolo[3,4-b]pyridines as potent dual orexin receptor antagonists (DORAs). Bioorg Med Chem Lett25:5555-60 (2015) 
 
Orexin/Hypocretin receptor type 1
Name:Orexin/Hypocretin receptor type 1
Type:Protein
Mol. Mass.:47554.50
Organism:Homo sapiens (Human)
Description:O43613
Residue:425
BDBM50133871
NameBDBM50133871
Synonyms:CHEMBL3634014
TypeSmall organic molecule
Emp. Form.C25H23F3N4O3
Mol. Mass.484.4703
SMILESCOc1ccc(cc1)[C@@H](C)NC(=O)COc1cc(c2c(nn(C)c2n1)-c1ccccc1)C(F)(F)F