Reaction Details
TargetOrexin/Hypocretin receptor type 1
LigandBDBM123358
Substrate/Competitorn/a
Meas. Tech.ChEMBL_1526534 (CHEMBL3635422)
Ki 52±n/a nM
Citation Behnke, DCotesta, SHintermann, SFendt, MGee, CEJacobson, LHLaue, GMeyer, AWagner, TBadiger, SChaudhari, VChebrolu, MPandit, CHoyer, DBetschart, C Discovery of 1H-pyrazolo[3,4-b]pyridines as potent dual orexin receptor antagonists (DORAs). Bioorg Med Chem Lett25:5555-60 (2015) 
 
Orexin/Hypocretin receptor type 1
Name:Orexin/Hypocretin receptor type 1
Type:Protein
Mol. Mass.:47554.50
Organism:Homo sapiens (Human)
Description:O43613
Residue:425
BDBM123358
NameBDBM123358
Synonyms:US8742106, 4.8
TypeSmall organic molecule
Emp. Form.C23H24N6O2
Mol. Mass.416.4757
SMILESC[C@H](NC(=O)COc1cc(C)c2c(nn(C)c2n1)-c1cnccn1)c1ccc(C)cc1