Reaction Details
TargetOrexin/Hypocretin receptor type 1
LigandBDBM50133883
Substrate/Competitorn/a
Meas. Tech.ChEMBL_1526534 (CHEMBL3635422)
Ki 970±n/a nM
Citation Behnke, DCotesta, SHintermann, SFendt, MGee, CEJacobson, LHLaue, GMeyer, AWagner, TBadiger, SChaudhari, VChebrolu, MPandit, CHoyer, DBetschart, C Discovery of 1H-pyrazolo[3,4-b]pyridines as potent dual orexin receptor antagonists (DORAs). Bioorg Med Chem Lett25:5555-60 (2015) 
 
Orexin/Hypocretin receptor type 1
Name:Orexin/Hypocretin receptor type 1
Type:Protein
Mol. Mass.:47554.50
Organism:Homo sapiens (Human)
Description:O43613
Residue:425
BDBM50133883
NameBDBM50133883
Synonyms:CHEMBL3634012
TypeSmall organic molecule
Emp. Form.C23H20F3N5O2
Mol. Mass.455.4324
SMILESCC(NC(=O)COc1cc(c2c(nn(C)c2n1)-c1ccccc1)C(F)(F)F)c1cccnc1