Reaction Details
TargetDelta-type opioid receptor
LigandBDBM50427559
Substrate/Competitorn/a
Meas. Tech.ChEMBL_1526572 (CHEMBL3635648)
Ki 10.0±n/a nM
Citation Harland, AAYeomans, LGriggs, NWAnand, JPPogozheva, IDJutkiewicz, EMTraynor, JRMosberg, HI Further Optimization and Evaluation of Bioavailable, Mixed-Efficacyµ-Opioid Receptor (MOR) Agonists/d-Opioid Receptor (DOR) Antagonists: Balancing MOR and DOR Affinities. J Med Chem58:8952-69 (2015) 
 
Delta-type opioid receptor
Name:Delta-type opioid receptor
Type:G Protein-Coupled Receptor (GPCR)
Mol. Mass.:40465.04
Organism:Rattus norvegicus (rat)
Description:Competition binding assays were using CHO-K1 cell membranes expressing the opioid receptor.
Residue:372
BDBM50427559
NameBDBM50427559
Synonyms:CHEMBL2322562
TypeSmall organic molecule
Emp. Form.C31H33N3O2
Mol. Mass.479.6126
SMILESCc1cc(O)cc(C)c1C[C@H](N)C(=O)N[C@@H]1CCNc2ccc(Cc3ccc4ccccc4c3)cc12