Reaction Details
TargetMu-type opioid receptor
LigandBDBM50427555
Substrate/Competitorn/a
Meas. Tech.ChEMBL_1526571 (CHEMBL3635647)
Ki 0.160000±n/a nM
Citation Harland, AAYeomans, LGriggs, NWAnand, JPPogozheva, IDJutkiewicz, EMTraynor, JRMosberg, HI Further Optimization and Evaluation of Bioavailable, Mixed-Efficacyµ-Opioid Receptor (MOR) Agonists/d-Opioid Receptor (DOR) Antagonists: Balancing MOR and DOR Affinities. J Med Chem58:8952-69 (2015) 
 
Mu-type opioid receptor
Name:Mu-type opioid receptor
Type:G Protein-Coupled Receptor (GPCR)
Mol. Mass.:44503.11
Organism:Rattus norvegicus (rat)
Description:Competition binding assays were carried out using membrane preparations from transfected HN9.10 cells that constitutively expressed the mu opioid receptor.
Residue:398
BDBM50427555
NameBDBM50427555
Synonyms:CHEMBL2322563
TypeSmall organic molecule
Emp. Form.C30H35N3O2
Mol. Mass.469.6178
SMILESCc1cc(O)cc(C)c1C[C@H](N)C(=O)N[C@@H]1CCNc2ccc(CC3Cc4ccccc4C3)cc12