Reaction Details
TargetReverse transcriptase
LigandBDBM50134211
Substrate/Competitorn/a
Meas. Tech.ChEMBL_1542247 (CHEMBL3745469)
IC50 2.7±n/a nM
Citation Gray, WTFrey, KMLaskey, SBMislak, ACSpasov, KALee, WGBollini, MSiliciano, RFJorgensen, WLAnderson, KS Potent Inhibitors Active against HIV Reverse Transcriptase with K101P, a Mutation Conferring Rilpivirine Resistance. ACS Med Chem Lett6:1075-9 (2015) 
 
Reverse transcriptase
Name:Reverse transcriptase
Synonyms:n/a
Type:Protein
Mol. Mass.:29598.37
Organism:Human immunodeficiency virus 1
Description:Q9WKE8
Residue:254
BDBM50134211
NameBDBM50134211
Synonyms:CHEMBL1923492
TypeSmall organic molecule
Emp. Form.C21H15F2N3O4
Mol. Mass.411.3583
SMILESFc1ccc(Oc2cc(F)cc(\C=C\C#N)c2)c(OCCn2ccc(=O)[nH]c2=O)c1