Reaction Details
TargetCarbonic anhydrase 1
LigandBDBM10861
Substrate/Competitorn/a
Meas. Tech.ChEMBL_1543851 (CHEMBL3748430)
Ki 21000±n/a nM
Citation Vullo, DBhatt, AMahon, BPMcKenna, RSupuran, CT Sulfonamide inhibition studies of thea-carbonic anhydrase from the gammaproteobacterium Thiomicrospira crunogena XCL-2, TcruCA. Bioorg Med Chem Lett26:401-5 (2016) 
 
Carbonic anhydrase 1
Name:Carbonic anhydrase 1
Type:Enzyme
Mol. Mass.:28873.37
Organism:Homo sapiens (Human)
Description:P00915
Residue:261
BDBM10861
NameBDBM10861
Synonyms:4-(2-aminoethyl)benzene-1-sulfonamide aromatic sulfonamide compound 7 | aromatic/heteroaromatic sulfonamide 6
TypeSmall organic molecule
Emp. Form.C8H12N2O2S
Mol. Mass.200.258
SMILESNCCc1ccc(cc1)S(N)(=O)=O