Reaction Details
TargetCarbonic anhydrase, alpha family
LigandBDBM10860
Substrate/Competitorn/a
Meas. Tech.ChEMBL_1543854 (CHEMBL3749744)
Ki 202±n/a nM
Citation Vullo, DBhatt, AMahon, BPMcKenna, RSupuran, CT Sulfonamide inhibition studies of thea-carbonic anhydrase from the gammaproteobacterium Thiomicrospira crunogena XCL-2, TcruCA. Bioorg Med Chem Lett26:401-5 (2016) 
 
Carbonic anhydrase, alpha family
Name:Carbonic anhydrase, alpha family
Synonyms:Carbonic anhydrase, alpha family
Type:PROTEIN
Mol. Mass.:35831.01
Organism:Thiomicrospira crunogena (strain XCL-2)
Description:ChEMBL_109899
Residue:315
BDBM10860
NameBDBM10860
TypeSmall organic molecule
Emp. Form.C7H10N2O2S
Mol. Mass.186.232
SMILESNCc1ccc(cc1)S(N)(=O)=O