Reaction Details
TargetCarbonic anhydrase, alpha family
LigandBDBM10870
Substrate/Competitorn/a
Meas. Tech.ChEMBL_1543854 (CHEMBL3749744)
Ki 5.6±n/a nM
Citation Vullo, DBhatt, AMahon, BPMcKenna, RSupuran, CT Sulfonamide inhibition studies of thea-carbonic anhydrase from the gammaproteobacterium Thiomicrospira crunogena XCL-2, TcruCA. Bioorg Med Chem Lett26:401-5 (2016) 
 
Carbonic anhydrase, alpha family
Name:Carbonic anhydrase, alpha family
Synonyms:Carbonic anhydrase, alpha family
Type:PROTEIN
Mol. Mass.:35831.01
Organism:Thiomicrospira crunogena (strain XCL-2)
Description:ChEMBL_109899
Residue:315
BDBM10870
NameBDBM10870
TypeSmall organic molecule
Emp. Form.C8H9N5O4S3
Mol. Mass.335.383
SMILESNc1ccc(cc1)S(=O)(=O)Nc1nnc(s1)S(N)(=O)=O