Reaction Details
TargetCarbonic anhydrase, alpha family
LigandBDBM10882
Substrate/Competitorn/a
Meas. Tech.ChEMBL_1543854 (CHEMBL3749744)
Ki 4.1±n/a nM
Citation Vullo, DBhatt, AMahon, BPMcKenna, RSupuran, CT Sulfonamide inhibition studies of thea-carbonic anhydrase from the gammaproteobacterium Thiomicrospira crunogena XCL-2, TcruCA. Bioorg Med Chem Lett26:401-5 (2016) 
 
Carbonic anhydrase, alpha family
Name:Carbonic anhydrase, alpha family
Synonyms:Carbonic anhydrase, alpha family
Type:PROTEIN
Mol. Mass.:35831.01
Organism:Thiomicrospira crunogena (strain XCL-2)
Description:ChEMBL_109899
Residue:315
BDBM10882
NameBDBM10882
TypeSmall organic molecule
Emp. Form.C9H10N2O3S2
Mol. Mass.258.317
SMILESCCOc1ccc2nc(sc2c1)S(N)(=O)=O