Reaction Details
TargetCarbonic anhydrase 2
LigandBDBM10870
Substrate/Competitorn/a
Meas. Tech.ChEMBL_1543852 (CHEMBL3748431)
Ki 2.0±n/a nM
Citation Vullo, DBhatt, AMahon, BPMcKenna, RSupuran, CT Sulfonamide inhibition studies of thea-carbonic anhydrase from the gammaproteobacterium Thiomicrospira crunogena XCL-2, TcruCA. Bioorg Med Chem Lett26:401-5 (2016) 
 
Carbonic anhydrase 2
Name:Carbonic anhydrase 2
Type:Enzyme
Mol. Mass.:29250.71
Organism:Homo sapiens (Human)
Description:P00918
Residue:260
BDBM10870
NameBDBM10870
Synonyms:2-N-(4-aminobenzene)-1,3,4-thiadiazole-2,5-disulfonamide CHEMBL268439 aminobenzolamide deriv. 43 | aromatic/heteroaromatic sulfonamide 15
TypeSmall organic molecule
Emp. Form.C8H9N5O4S3
Mol. Mass.335.383
SMILESNc1ccc(cc1)S(=O)(=O)Nc1nnc(s1)S(N)(=O)=O