Reaction Details
TargetCarbonic anhydrase 2
LigandBDBM10886
Substrate/Competitorn/a
Meas. Tech.ChEMBL_1543852 (CHEMBL3748431)
Ki 9.0±n/a nM
Citation Vullo, DBhatt, AMahon, BPMcKenna, RSupuran, CT Sulfonamide inhibition studies of thea-carbonic anhydrase from the gammaproteobacterium Thiomicrospira crunogena XCL-2, TcruCA. Bioorg Med Chem Lett26:401-5 (2016) 
 
Carbonic anhydrase 2
Name:Carbonic anhydrase 2
Type:Enzyme
Mol. Mass.:29250.71
Organism:Homo sapiens (Human)
Description:P00918
Residue:260
BDBM10886
NameBDBM10886
Synonyms:2-N-benzene-1,3,4-thiadiazole-2,5-disulfonamide Benzolamide CHEMBL73962
TypeSmall organic molecule
Emp. Form.C8H8N4O4S3
Mol. Mass.320.369
SMILESNS(=O)(=O)c1nnc(NS(=O)(=O)c2ccccc2)s1