Reaction Details
TargetCarbonic anhydrase
LigandBDBM10862
Substrate/Competitorn/a
Meas. Tech.ChEMBL_1543853 (CHEMBL3749743)
Ki 68±n/a nM
Citation Vullo, DBhatt, AMahon, BPMcKenna, RSupuran, CT Sulfonamide inhibition studies of thea-carbonic anhydrase from the gammaproteobacterium Thiomicrospira crunogena XCL-2, TcruCA. Bioorg Med Chem Lett26:401-5 (2016) 
 
Carbonic anhydrase
Name:Carbonic anhydrase
Type:PROTEIN
Mol. Mass.:28438.71
Organism:Sulfurihydrogenibium sp. (strain YO3AOP1)
Description:ChEMBL_116696
Residue:246
BDBM10862
NameBDBM10862
Synonyms:4-Amino-3-fluorobenzenesulfonamide CHEMBL6853 halogenosulfanilamide deriv. 5b
TypeSmall organic molecule
Emp. Form.C6H7FN2O2S
Mol. Mass.190.195
SMILESNc1ccc(cc1F)S(N)(=O)=O