Reaction Details
TargetMitogen-activated protein kinase 8
LigandBDBM50134593
Substrate/Competitorn/a
Meas. Tech.ChEMBL_1544314 (CHEMBL3751431)
IC50 650±n/a nM
Citation Simon-Szabó, LKokas, MGreff, ZBoros, SBánhegyi, PZsákai, LSzántai-Kis, CVantus, TMandl, JBánhegyi, GVályi-Nagy, IOrfi, LUllrich, ACsala, MKéri, G Novel compounds reducing IRS-1 serine phosphorylation for treatment of diabetes. Bioorg Med Chem Lett26:424-8 (2016) 
 
Mitogen-activated protein kinase 8
Name:Mitogen-activated protein kinase 8
Type:Enzyme
Mol. Mass.:48297.57
Organism:Homo sapiens (Human)
Description:JNK-1 was purchased from Upstate Cell Signaling Solutions (formerly Upstate Biotechnology).
Residue:427
BDBM50134593
NameBDBM50134593
Synonyms:CHEMBL3747699
TypeSmall organic molecule
Emp. Form.C20H21F2N5O4S
Mol. Mass.465.474
SMILESCn1c2nc(NC3CCN(CC3)S(C)(=O)=O)ncc2cc(Oc2ccc(F)cc2F)c1=O