Reaction Details
Target5-hydroxytryptamine receptor 7
LigandBDBM50134678
Substrate/Competitorn/a
Meas. Tech.ChEMBL_1545081 (CHEMBL3750141)
Ki 5.0±n/a nM
Citation Canale, VKurczab, RPartyka, ASatala, GSloczynska, KKos, TJastrzebska-Wiesek, MSiwek, APekala, EBojarski, AJWesolowska, APopik, PZajdel, P N-Alkylated arylsulfonamides of (aryloxy)ethyl piperidines: 5-HT(7) receptor selectivity versus multireceptor profile. Bioorg Med Chem24:130-9 (2016) 
 
5-hydroxytryptamine receptor 7
Name:5-hydroxytryptamine receptor 7
Type:G Protein-Coupled Receptor (GPCR)
Mol. Mass.:53573.08
Organism:Homo sapiens (Human)
Description:P34969
Residue:479
BDBM50134678
NameBDBM50134678
Synonyms:CHEMBL3745815
TypeSmall organic molecule
Emp. Form.C26H29FN2O3S
Mol. Mass.468.583
SMILESCN(C1CCN(CCOc2ccccc2-c2ccccc2)CC1)S(=O)(=O)c1ccc(F)cc1