Reaction Details
TargetPolyphenol oxidase 2
LigandBDBM50134713
Substrate/Competitorn/a
Meas. Tech.ChEMBL_1543864 (CHEMBL3749754)
Ki 49700±n/a nM
Citation Tan, XSong, YHPark, CLee, KWKim, JYKim, DWKim, KDLee, KWCurtis-Long, MJPark, KH Highly potent tyrosinase inhibitor, neorauflavane from Campylotropis hirtella and inhibitory mechanism with molecular docking. Bioorg Med Chem24:153-9 (2016) 
 
Polyphenol oxidase 2
Name:Polyphenol oxidase 2
Type:Protein
Mol. Mass.:63923.66
Organism:Agaricus bisporus (Common mushroom)
Description:O42713
Residue:556
BDBM50134713
NameBDBM50134713
Synonyms:CHEMBL3746757
TypeSmall organic molecule
Emp. Form.C25H26O6
Mol. Mass.422.4703
SMILES[#6]\[#6](-[#6])=[#6]\[#6]-[#6]\[#6](-[#6])=[#6]\[#6]-c1c(-[#8])ccc(c1-[#8])-c1coc2cc(-[#8])cc(-[#8])c2c1=O