Reaction Details
TargetP2X purinoceptor 7
LigandBDBM160076
Substrate/Competitorn/a
Meas. Tech.ChEMBL_1543891 (CHEMBL3749873)
IC50 0.200000±n/a nM
Citation Ameriks, MKAo, HCarruthers, NILord, BRavula, SRech, JCSavall, BMWall, JLWang, QBhattacharya, ALetavic, MA Preclinical characterization of substituted 6,7-dihydro-[1,2,4]triazolo[4,3-a]pyrazin-8(5H)-one P2X7 receptor antagonists. Bioorg Med Chem Lett26:257-61 (2016) 
 
P2X purinoceptor 7
Name:P2X purinoceptor 7
Type:Protein
Mol. Mass.:68602.85
Organism:Homo sapiens (Human)
Description:Q99572
Residue:595
BDBM160076
NameBDBM160076
Synonyms:US10047092, 17 US9040534, 17
TypeSmall organic molecule
Emp. Form.C20H15ClF4N4O
Mol. Mass.438.806
SMILESC[C@H]1Cn2c(nnc2-c2ccc(F)cc2)C(=O)N1Cc1cccc(c1Cl)C(F)(F)F