Reaction Details
TargetP2X purinoceptor 7
LigandBDBM160089
Substrate/Competitorn/a
Meas. Tech.ChEMBL_1543892 (CHEMBL3749874)
IC50 380±n/a nM
Citation Ameriks, MKAo, HCarruthers, NILord, BRavula, SRech, JCSavall, BMWall, JLWang, QBhattacharya, ALetavic, MA Preclinical characterization of substituted 6,7-dihydro-[1,2,4]triazolo[4,3-a]pyrazin-8(5H)-one P2X7 receptor antagonists. Bioorg Med Chem Lett26:257-61 (2016) 
 
P2X purinoceptor 7
Name:P2X purinoceptor 7
Type:Protein
Mol. Mass.:68403.50
Organism:Rattus norvegicus (Rat)
Description:Q64663
Residue:595
BDBM160089
NameBDBM160089
Synonyms:US10047092, 30 US9040534, 30
TypeSmall organic molecule
Emp. Form.C19H14ClF4N5O
Mol. Mass.439.794
SMILESC[C@H]1Cn2c(nnc2-c2ccc(F)cn2)C(=O)N1Cc1cccc(c1Cl)C(F)(F)F