Reaction Details
TargetPotassium voltage-gated channel subfamily H member 2
LigandBDBM50134771
Substrate/Competitorn/a
Meas. Tech.ChEMBL_1549436 (CHEMBL3755587)
IC50 1800±n/a nM
Citation Ammirati, MBagley, SWBhattacharya, SKBuckbinder, LCarlo, AAConrad, RCortes, CDow, RLDowling, MSEl-Kattan, AFord, KGuimarães, CRHepworth, DJiao, WLaPerle, JLiu, SLondregan, ALoria, PMMathiowetz, AMMunchhof, MOrr, STPetersen, DNPrice, DASkoura, ASmith, ACWang, J Discovery of an in Vivo Tool to Establish Proof-of-Concept for MAP4K4-Based Antidiabetic Treatment. ACS Med Chem Lett6:1128-33 (2015) 
 
Potassium voltage-gated channel subfamily H member 2
Name:Potassium voltage-gated channel subfamily H member 2
Type:Multi-pass membrane protein
Mol. Mass.:126672.65
Organism:Homo sapiens (Human)
Description:Q12809
Residue:1159
BDBM50134771
NameBDBM50134771
Synonyms:CHEMBL3754515
TypeSmall organic molecule
Emp. Form.C16H13ClN4
Mol. Mass.296.754
SMILESNc1ccc(cn1)-c1cnc(N)c(c1)-c1ccc(Cl)cc1