Reaction Details
TargetMitogen-activated protein kinase kinase kinase kinase 4
LigandBDBM50138153
Substrate/Competitorn/a
Meas. Tech.ChEMBL_1549419 (CHEMBL3755426)
IC50 21±n/a nM
Citation Ammirati, MBagley, SWBhattacharya, SKBuckbinder, LCarlo, AAConrad, RCortes, CDow, RLDowling, MSEl-Kattan, AFord, KGuimarães, CRHepworth, DJiao, WLaPerle, JLiu, SLondregan, ALoria, PMMathiowetz, AMMunchhof, MOrr, STPetersen, DNPrice, DASkoura, ASmith, ACWang, J Discovery of an in Vivo Tool to Establish Proof-of-Concept for MAP4K4-Based Antidiabetic Treatment. ACS Med Chem Lett6:1128-33 (2015) 
 
Mitogen-activated protein kinase kinase kinase kinase 4
Name:Mitogen-activated protein kinase kinase kinase kinase 4
Type:Serine/threonine-protein kinase
Mol. Mass.:142114.73
Organism:Homo sapiens (Human)
Description:O95819
Residue:1239
BDBM50138153
NameBDBM50138153
Synonyms:CHEMBL3754283
TypeSmall organic molecule
Emp. Form.C18H16N2O3S
Mol. Mass.340.396
SMILESCS(=O)(=O)c1ccc(cc1)-c1cc(cnc1N)-c1ccc(O)cc1