Reaction Details
TargetMitogen-activated protein kinase kinase kinase kinase 4
LigandBDBM50138158
Substrate/Competitorn/a
Meas. Tech.ChEMBL_1549419 (CHEMBL3755426)
IC50 45±n/a nM
Citation Ammirati, MBagley, SWBhattacharya, SKBuckbinder, LCarlo, AAConrad, RCortes, CDow, RLDowling, MSEl-Kattan, AFord, KGuimarães, CRHepworth, DJiao, WLaPerle, JLiu, SLondregan, ALoria, PMMathiowetz, AMMunchhof, MOrr, STPetersen, DNPrice, DASkoura, ASmith, ACWang, J Discovery of an in Vivo Tool to Establish Proof-of-Concept for MAP4K4-Based Antidiabetic Treatment. ACS Med Chem Lett6:1128-33 (2015) 
 
Mitogen-activated protein kinase kinase kinase kinase 4
Name:Mitogen-activated protein kinase kinase kinase kinase 4
Type:Serine/threonine-protein kinase
Mol. Mass.:142114.73
Organism:Homo sapiens (Human)
Description:O95819
Residue:1239
BDBM50138158
NameBDBM50138158
Synonyms:CHEMBL3752854
TypeSmall organic molecule
Emp. Form.C19H16N2O2
Mol. Mass.304.3425
SMILESCOc1ccc(cc1)-c1cncc(c1)-c1ccc(cc1)C(N)=O