Reaction Details
TargetMitogen-activated protein kinase kinase kinase kinase 4
LigandBDBM50134772
Substrate/Competitorn/a
Meas. Tech.ChEMBL_1549419 (CHEMBL3755426)
IC50 15±n/a nM
Citation Ammirati, MBagley, SWBhattacharya, SKBuckbinder, LCarlo, AAConrad, RCortes, CDow, RLDowling, MSEl-Kattan, AFord, KGuimarães, CRHepworth, DJiao, WLaPerle, JLiu, SLondregan, ALoria, PMMathiowetz, AMMunchhof, MOrr, STPetersen, DNPrice, DASkoura, ASmith, ACWang, J Discovery of an in Vivo Tool to Establish Proof-of-Concept for MAP4K4-Based Antidiabetic Treatment. ACS Med Chem Lett6:1128-33 (2015) 
 
Mitogen-activated protein kinase kinase kinase kinase 4
Name:Mitogen-activated protein kinase kinase kinase kinase 4
Type:Serine/threonine-protein kinase
Mol. Mass.:142114.73
Organism:Homo sapiens (Human)
Description:O95819
Residue:1239
BDBM50134772
NameBDBM50134772
Synonyms:CHEMBL3754123
TypeSmall organic molecule
Emp. Form.C15H12ClN5
Mol. Mass.297.742
SMILESNc1ncc(cn1)-c1cnc(N)c(c1)-c1ccc(Cl)cc1