Reaction Details
TargetDual specificity mitogen-activated protein kinase kinase 1
LigandBDBM50134925
Substrate/Competitorn/a
Meas. Tech.ChEMBL_1544506 (CHEMBL3750088)
IC50 14±n/a nM
Citation Hartung, IVHammer, SHitchcock, MNeuhaus, RScholz, ASiemeister, GBohlmann, RHillig, RCPühler, F Optimization of allosteric MEK inhibitors. Part 2: Taming the sulfamide group balances compound distribution properties. Bioorg Med Chem Lett26:186-93 (2015) 
 
Dual specificity mitogen-activated protein kinase kinase 1
Name:Dual specificity mitogen-activated protein kinase kinase 1
Type:Other Protein Type
Mol. Mass.:43439.03
Organism:Homo sapiens (Human)
Description:Full-length human MEK-1 was generated by PCR and purified as a fusion protein from Escherichia coli lysates.
Residue:393
BDBM50134925
NameBDBM50134925
Synonyms:CHEMBL2376666
TypeSmall organic molecule
Emp. Form.C19H15F2IN4O4S
Mol. Mass.560.313
SMILESNC(=O)c1c(Nc2ccc(I)cc2F)cc(F)cc1Oc1cccc(NS(N)(=O)=O)c1