Reaction Details
TargetDual specificity mitogen-activated protein kinase kinase 1
LigandBDBM50134976
Substrate/Competitorn/a
Meas. Tech.ChEMBL_1544506 (CHEMBL3750088)
IC50 13±n/a nM
Citation Hartung, IVHammer, SHitchcock, MNeuhaus, RScholz, ASiemeister, GBohlmann, RHillig, RCPühler, F Optimization of allosteric MEK inhibitors. Part 2: Taming the sulfamide group balances compound distribution properties. Bioorg Med Chem Lett26:186-93 (2015) 
 
Dual specificity mitogen-activated protein kinase kinase 1
Name:Dual specificity mitogen-activated protein kinase kinase 1
Type:Other Protein Type
Mol. Mass.:43439.03
Organism:Homo sapiens (Human)
Description:Full-length human MEK-1 was generated by PCR and purified as a fusion protein from Escherichia coli lysates.
Residue:393
BDBM50134976
NameBDBM50134976
Synonyms:CHEMBL3746736
TypeSmall organic molecule
Emp. Form.C19H14F3IN4O4S
Mol. Mass.578.304
SMILESNC(=O)c1c(Oc2cccc(NS(N)(=O)=O)c2)cc(F)c(F)c1Nc1ccc(I)cc1F