Reaction Details
TargetDual specificity mitogen-activated protein kinase kinase 1
LigandBDBM50355497
Substrate/Competitorn/a
Meas. Tech.ChEMBL_1544506 (CHEMBL3750088)
IC50 31±n/a nM
Citation Hartung, IVHammer, SHitchcock, MNeuhaus, RScholz, ASiemeister, GBohlmann, RHillig, RCPühler, F Optimization of allosteric MEK inhibitors. Part 2: Taming the sulfamide group balances compound distribution properties. Bioorg Med Chem Lett26:186-93 (2015) 
 
Dual specificity mitogen-activated protein kinase kinase 1
Name:Dual specificity mitogen-activated protein kinase kinase 1
Type:Other Protein Type
Mol. Mass.:43439.03
Organism:Homo sapiens (Human)
Description:Full-length human MEK-1 was generated by PCR and purified as a fusion protein from Escherichia coli lysates.
Residue:393
BDBM50355497
NameBDBM50355497
Synonyms:AZD-6244 | CHEMBL1614701
TypeSmall organic molecule
Emp. Form.C17H15BrClFN4O3
Mol. Mass.457.681
SMILESCn1cnc2c(F)c(Nc3ccc(Br)cc3Cl)c(cc12)C(=O)NOCCO