Reaction Details
TargetSimilar to alpha-tubulin isoform 1
LigandBDBM50135177
Substrate/Competitorn/a
Meas. Tech.ChEMBL_1545475 (CHEMBL3748719)
IC50 2000±n/a nM
Citation Romagnoli, RBaraldi, PGPrencipe, FLopez-Cara, CRondanin, RSimoni, DHamel, EGrimaudo, SPipitone, RMMeli, MTolomeo, M Novel iodoacetamido benzoheterocyclic derivatives with potent antileukemic activity are inhibitors of STAT5 phosphorylation. Eur J Med Chem108:39-52 (2016) 
 
Similar to alpha-tubulin isoform 1
Name:Similar to alpha-tubulin isoform 1
Synonyms:Similar to alpha-tubulin isoform 1
Type:PROTEIN
Mol. Mass.:10383.05
Organism:Bos taurus
Description:ChEMBL_104716
Residue:99
BDBM50135177
NameBDBM50135177
Synonyms:CHEMBL3747558
TypeSmall organic molecule
Emp. Form.C22H23IN2O6
Mol. Mass.538.3323
SMILESCOc1cc(cc(OC)c1OC)C(=O)c1c(NC(=O)CI)c2cccc(OC)c2n1C