Reaction Details
TargetSerine protease hepsin
LigandBDBM50135268
Substrate/Competitorn/a
Meas. Tech.ChEMBL_1544367 (CHEMBL3748443)
Ki 1.0±n/a nM
Citation Kwon, HKim, YPark, KChoi, SASon, SHByun, Y Structure-based design, synthesis, and biological evaluation of Leu-Arg dipeptide analogs as novel hepsin inhibitors. Bioorg Med Chem Lett26:310-4 (2016) 
 
Serine protease hepsin
Name:Serine protease hepsin
Type:Enzyme
Mol. Mass.:45016.98
Organism:Homo sapiens (Human)
Description:Human deglycosylated hepsin was expressed in Pichia pastoris.
Residue:417
BDBM50135268
NameBDBM50135268
Synonyms:CHEMBL3747482
TypeSmall organic molecule
Emp. Form.C22H36N8O5S
Mol. Mass.524.637
SMILESCC(C)C[C@H](NC(=O)[C@H](CCC(N)=O)NC(C)=O)C(=O)N[C@@H](CCCNC(N)=N)C(=O)c1nccs1