Reaction Details
TargetSerine protease hepsin
LigandBDBM50135269
Substrate/Competitorn/a
Meas. Tech.ChEMBL_1544367 (CHEMBL3748443)
Ki 0.830000±n/a nM
Citation Kwon, HKim, YPark, KChoi, SASon, SHByun, Y Structure-based design, synthesis, and biological evaluation of Leu-Arg dipeptide analogs as novel hepsin inhibitors. Bioorg Med Chem Lett26:310-4 (2016) 
 
Serine protease hepsin
Name:Serine protease hepsin
Type:Enzyme
Mol. Mass.:45016.98
Organism:Homo sapiens (Human)
Description:Human deglycosylated hepsin was expressed in Pichia pastoris.
Residue:417
BDBM50135269
NameBDBM50135269
Synonyms:CHEMBL3745775
TypeSmall organic molecule
Emp. Form.C28H48N10O6S
Mol. Mass.652.809
SMILESCC(C)C[C@H](NC(=O)[C@H](CCC(N)=O)NC(=O)[C@H](CCCCN)NC(C)=O)C(=O)N[C@H](CCCNC(N)=N)C(=O)c1nccs1