Reaction Details
TargetSerine protease hepsin
LigandBDBM50135278
Substrate/Competitorn/a
Meas. Tech.ChEMBL_1544367 (CHEMBL3748443)
Ki>10000±n/a nM
Citation Kwon, HKim, YPark, KChoi, SASon, SHByun, Y Structure-based design, synthesis, and biological evaluation of Leu-Arg dipeptide analogs as novel hepsin inhibitors. Bioorg Med Chem Lett26:310-4 (2016) 
 
Serine protease hepsin
Name:Serine protease hepsin
Type:Enzyme
Mol. Mass.:45016.98
Organism:Homo sapiens (Human)
Description:Human deglycosylated hepsin was expressed in Pichia pastoris.
Residue:417
BDBM50135278
NameBDBM50135278
Synonyms:CHEMBL3747693
TypeSmall organic molecule
Emp. Form.C19H35N5O6
Mol. Mass.429.5111
SMILESCC(C)C[C@H](NC(=O)[C@H](CCC(N)=O)NC(=O)[C@H](CCCCN)NC(C)=O)C(O)=O