Reaction Details
TargetSuppressor of tumorigenicity 14 protein homolog
LigandBDBM50135269
Substrate/Competitorn/a
Meas. Tech.ChEMBL_1544368 (CHEMBL3748444)
Ki 8.0±n/a nM
Citation Kwon, HKim, YPark, KChoi, SASon, SHByun, Y Structure-based design, synthesis, and biological evaluation of Leu-Arg dipeptide analogs as novel hepsin inhibitors. Bioorg Med Chem Lett26:310-4 (2016) 
 
Suppressor of tumorigenicity 14 protein homolog
Name:Suppressor of tumorigenicity 14 protein homolog
Type:PROTEIN
Mol. Mass.:94658.46
Organism:Mus musculus
Description:ChEMBL_116697
Residue:855
BDBM50135269
NameBDBM50135269
Synonyms:CHEMBL3745775
TypeSmall organic molecule
Emp. Form.C28H48N10O6S
Mol. Mass.652.809
SMILESCC(C)C[C@H](NC(=O)[C@H](CCC(N)=O)NC(=O)[C@H](CCCCN)NC(C)=O)C(=O)N[C@H](CCCNC(N)=N)C(=O)c1nccs1