Reaction Details
TargetSuppressor of tumorigenicity 14 protein homolog
LigandBDBM50135268
Substrate/Competitorn/a
Meas. Tech.ChEMBL_1544368 (CHEMBL3748444)
Ki 11±n/a nM
Citation Kwon, HKim, YPark, KChoi, SASon, SHByun, Y Structure-based design, synthesis, and biological evaluation of Leu-Arg dipeptide analogs as novel hepsin inhibitors. Bioorg Med Chem Lett26:310-4 (2016) 
 
Suppressor of tumorigenicity 14 protein homolog
Name:Suppressor of tumorigenicity 14 protein homolog
Type:PROTEIN
Mol. Mass.:94658.46
Organism:Mus musculus
Description:ChEMBL_116697
Residue:855
BDBM50135268
NameBDBM50135268
Synonyms:CHEMBL3747482
TypeSmall organic molecule
Emp. Form.C22H36N8O5S
Mol. Mass.524.637
SMILESCC(C)C[C@H](NC(=O)[C@H](CCC(N)=O)NC(C)=O)C(=O)N[C@@H](CCCNC(N)=N)C(=O)c1nccs1