Reaction Details
TargetSuppressor of tumorigenicity 14 protein homolog
LigandBDBM50135276
Substrate/Competitorn/a
Meas. Tech.ChEMBL_1544368 (CHEMBL3748444)
Ki>10000±n/a nM
Citation Kwon, HKim, YPark, KChoi, SASon, SHByun, Y Structure-based design, synthesis, and biological evaluation of Leu-Arg dipeptide analogs as novel hepsin inhibitors. Bioorg Med Chem Lett26:310-4 (2016) 
 
Suppressor of tumorigenicity 14 protein homolog
Name:Suppressor of tumorigenicity 14 protein homolog
Type:PROTEIN
Mol. Mass.:94658.46
Organism:Mus musculus
Description:ChEMBL_116697
Residue:855
BDBM50135276
NameBDBM50135276
Synonyms:CHEMBL3746062
TypeSmall organic molecule
Emp. Form.C20H31N5O3
Mol. Mass.389.4918
SMILESCC(C)C[C@H](NC(C)=O)C(=O)N[C@@H](CCCNC(N)=N)C(=O)c1ccccc1