Reaction Details
TargetAmyloid-beta precursor protein
LigandBDBM26658
Substrate/Competitorn/a
Meas. Tech.ChEMBL_1545148 (CHEMBL3750502)
IC50 30300±n/a nM
Citation Hanaki, MMurakami, KAkagi, KIrie, K Structural insights into mechanisms for inhibiting amyloidß42 aggregation by non-catechol-type flavonoids. Bioorg Med Chem24:304-13 (2016) 
 
Amyloid-beta precursor protein
Name:Amyloid-beta precursor protein
Type:Single-pass type I membrane protein
Mol. Mass.:86890.41
Organism:Homo sapiens (Human)
Description:P05067
Residue:770
BDBM26658
NameBDBM26658
Synonyms:2-(2,4-dihydroxyphenyl)-3,5,7-trihydroxy-1-benzopyran-4-one 2-(2,4-dihydroxyphenyl)-3,5,7-trihydroxy-chromone 2-[2,4-bis(oxidanyl)phenyl]-3,5,7-tris(oxidanyl)chromen-4-one MLS000069618 Morin (5) SMR000058259 morin
TypeFlavonoid
Emp. Form.C15H10O7
Mol. Mass.302.2357
SMILESOc1ccc(c(O)c1)-c1oc2cc(O)cc(O)c2c(=O)c1O