Reaction Details
TargetCyclin-A2/Cyclin-dependent kinase 2
LigandBDBM50135286
Substrate/Competitorn/a
Meas. Tech.ChEMBL_1546466 (CHEMBL3748657)
IC50>10000±n/a nM
Citation Reddy, MVAkula, BJatiani, SVasquez-Del Carpio, RBilla, VKMallireddigari, MRCosenza, SCVenkata Subbaiah, DRBharathi, EVPallela, VRRamkumar, PJain, RAggarwal, AKReddy, EP Discovery of 2-(1H-indol-5-ylamino)-6-(2,4-difluorophenylsulfonyl)-8-methylpyrido[2,3-d]pyrimidin-7(8H)-one (7ao) as a potent selective inhibitor of Polo like kinase 2 (PLK2). Bioorg Med Chem24:521-44 (2016) 
 
Cyclin-A2/Cyclin-dependent kinase 2
Name:Cyclin-A2/Cyclin-dependent kinase 2
Type:Protein Complex
Mol. Mass.:n/a
Description:Cdk2/Cyclin A kinase was purified from insect cells coinfected with Cyclin A/Cdk2 baculovirus.
Components:This complex has 2 components.
Component 1
Name:Cyclin-dependent kinase 2
Synonyms:CDK2 CDK2_HUMAN Cell division protein kinase 2 Protein cereblon/Cyclin-dependent kinase 2 | p33 protein kinase
Type:Enzyme Subunit
Mol. Mass.:33938.17
Organism:Homo sapiens (Human)
Description:P24941
Residue:298
Component 2
Name:Cyclin-A2
Synonyms:CCN1 CCNA1 CCNA2_HUMAN Cyclin-A
Type:Enzyme Subunit
Mol. Mass.:48550.19
Organism:Homo sapiens (Human)
Description:P20248
Residue:432
BDBM50135286
NameBDBM50135286
Synonyms:CHEMBL3745885
TypeSmall organic molecule
Emp. Form.C22H15F2N5O3S
Mol. Mass.467.448
SMILESCn1c2nc(Nc3ccc4[nH]ccc4c3)ncc2cc(c1=O)S(=O)(=O)c1ccc(F)cc1F