Reaction Details
TargetcAMP-dependent protein kinase catalytic subunit beta
LigandBDBM50135286
Substrate/Competitorn/a
Meas. Tech.ChEMBL_1546949 (CHEMBL3748052)
IC50>10000±n/a nM
Citation Reddy, MVAkula, BJatiani, SVasquez-Del Carpio, RBilla, VKMallireddigari, MRCosenza, SCVenkata Subbaiah, DRBharathi, EVPallela, VRRamkumar, PJain, RAggarwal, AKReddy, EP Discovery of 2-(1H-indol-5-ylamino)-6-(2,4-difluorophenylsulfonyl)-8-methylpyrido[2,3-d]pyrimidin-7(8H)-one (7ao) as a potent selective inhibitor of Polo like kinase 2 (PLK2). Bioorg Med Chem24:521-44 (2016) 
 
cAMP-dependent protein kinase catalytic subunit beta
Name:cAMP-dependent protein kinase catalytic subunit beta
Type:PROTEIN
Mol. Mass.:40631.25
Organism:Homo sapiens (Human)
Description:ChEMBL_586348
Residue:351
BDBM50135286
NameBDBM50135286
Synonyms:CHEMBL3745885
TypeSmall organic molecule
Emp. Form.C22H15F2N5O3S
Mol. Mass.467.448
SMILESCn1c2nc(Nc3ccc4[nH]ccc4c3)ncc2cc(c1=O)S(=O)(=O)c1ccc(F)cc1F