Reaction Details
TargetAromatase
LigandBDBM50135970
Substrate/Competitorn/a
Meas. Tech.ChEMBL_1547124 (CHEMBL3755859)
Ki 2.5±n/a nM
Citation Yadav, MRBarmade, MATamboli, RSMurumkar, PR Developing steroidal aromatase inhibitors-an effective armament to win the battle against breast cancer. Eur J Med Chem105:1-38 (2015) 
 
Aromatase
Name:Aromatase
Type:Enzyme
Mol. Mass.:57888.92
Organism:Homo sapiens (Human)
Description:P11511
Residue:503
BDBM50135970
NameBDBM50135970
Synonyms:CHEMBL3752341
TypeSmall organic molecule
Emp. Form.C26H36O2
Mol. Mass.380.5628
SMILES[H][C@@]12CCC(=O)[C@@]1(C)CC[C@@]1([H])[C@@]2([H])C=C(CCCCCCC)C2=CC(=O)C=C[C@]12C