Reaction Details
TargetAromatase
LigandBDBM50136057
Substrate/Competitorn/a
Meas. Tech.ChEMBL_1547299 (CHEMBL3756935)
Ki 1.4±n/a nM
Citation Yadav, MRBarmade, MATamboli, RSMurumkar, PR Developing steroidal aromatase inhibitors-an effective armament to win the battle against breast cancer. Eur J Med Chem105:1-38 (2015) 
 
Aromatase
Name:Aromatase
Type:Enzyme
Mol. Mass.:57888.92
Organism:Homo sapiens (Human)
Description:P11511
Residue:503
BDBM50136057
NameBDBM50136057
Synonyms:CHEMBL3752661
TypeSmall organic molecule
Emp. Form.C21H30O2
Mol. Mass.314.4617
SMILES[H][C@@]12CCC(=O)[C@@]1(C)CC[C@@]1([H])[C@@]2([H])C[C@@H](CC)C2=CC(=O)CC[C@]12C