Reaction Details
TargetSphingosine 1-phosphate receptor 1
LigandBDBM50136353
Substrate/Competitorn/a
Meas. Tech.ChEMBL_1548095 (CHEMBL3757927)
EC50 18±n/a nM
Citation Horan, JCKuzmich, DLiu, PDiSalvo, DLord, JMao, CHopkins, TDYu, HHarcken, CBetageri, RHill-Drzewi, MPatenaude, LPatel, MFletcher, KTerenzzio, DLinehan, BXia, HPatel, MStudwell, DMiller, CHickey, ELevin, JISmith, DKemper, RAModis, LKBannen, LCChan, DSMac, MBNg, SWang, YXu, WLemieux, RM Late-stage optimization of a tercyclic class of S1P3-sparing, S1P1 receptor agonists. Bioorg Med Chem Lett26:466-71 (2016) 
 
Sphingosine 1-phosphate receptor 1
Name:Sphingosine 1-phosphate receptor 1
Type:Enzyme
Mol. Mass.:42836.02
Organism:Homo sapiens (Human)
Description:P21453
Residue:382
BDBM50136353
NameBDBM50136353
Synonyms:CHEMBL3753062
TypeSmall organic molecule
Emp. Form.C20H23ClFN5O2S
Mol. Mass.451.945
SMILESCC(C)Nc1cc(cc(C)n1)-c1nnc(s1)-c1cc(F)c(OC[C@H](N)CO)cc1Cl