Reaction Details
TargetSphingosine 1-phosphate receptor 1
LigandBDBM50136456
Substrate/Competitorn/a
Meas. Tech.ChEMBL_1548095 (CHEMBL3757927)
EC50 0.800000±n/a nM
Citation Horan, JCKuzmich, DLiu, PDiSalvo, DLord, JMao, CHopkins, TDYu, HHarcken, CBetageri, RHill-Drzewi, MPatenaude, LPatel, MFletcher, KTerenzzio, DLinehan, BXia, HPatel, MStudwell, DMiller, CHickey, ELevin, JISmith, DKemper, RAModis, LKBannen, LCChan, DSMac, MBNg, SWang, YXu, WLemieux, RM Late-stage optimization of a tercyclic class of S1P3-sparing, S1P1 receptor agonists. Bioorg Med Chem Lett26:466-71 (2016) 
 
Sphingosine 1-phosphate receptor 1
Name:Sphingosine 1-phosphate receptor 1
Type:Enzyme
Mol. Mass.:42836.02
Organism:Homo sapiens (Human)
Description:P21453
Residue:382
BDBM50136456
NameBDBM50136456
Synonyms:CHEMBL3753209
TypeSmall organic molecule
Emp. Form.C22H23ClFN5O3
Mol. Mass.459.901
SMILESCC(C)Nc1cc(cc(C)n1)-c1nc(no1)-c1cc(F)c(O[C@@H]2CCC(=O)NC2)cc1Cl