Reaction Details
TargetSphingosine 1-phosphate receptor 1
LigandBDBM50136543
Substrate/Competitorn/a
Meas. Tech.ChEMBL_1548095 (CHEMBL3757927)
EC50 37±n/a nM
Citation Horan, JCKuzmich, DLiu, PDiSalvo, DLord, JMao, CHopkins, TDYu, HHarcken, CBetageri, RHill-Drzewi, MPatenaude, LPatel, MFletcher, KTerenzzio, DLinehan, BXia, HPatel, MStudwell, DMiller, CHickey, ELevin, JISmith, DKemper, RAModis, LKBannen, LCChan, DSMac, MBNg, SWang, YXu, WLemieux, RM Late-stage optimization of a tercyclic class of S1P3-sparing, S1P1 receptor agonists. Bioorg Med Chem Lett26:466-71 (2016) 
 
Sphingosine 1-phosphate receptor 1
Name:Sphingosine 1-phosphate receptor 1
Type:Enzyme
Mol. Mass.:42836.02
Organism:Homo sapiens (Human)
Description:P21453
Residue:382
BDBM50136543
NameBDBM50136543
Synonyms:CHEMBL3752005
TypeSmall organic molecule
Emp. Form.C22H25N5O4
Mol. Mass.423.465
SMILESCC(C)Cc1cc(cc(C)n1)-c1nc(no1)-c1ccc(OC[C@H]2COC(=O)N2)c(C)n1