Reaction Details
TargetSphingosine 1-phosphate receptor 3
LigandBDBM50158336
Substrate/Competitorn/a
Meas. Tech.ChEMBL_1548096 (CHEMBL3757928)
EC50>10000±n/a nM
Citation Horan, JCKuzmich, DLiu, PDiSalvo, DLord, JMao, CHopkins, TDYu, HHarcken, CBetageri, RHill-Drzewi, MPatenaude, LPatel, MFletcher, KTerenzzio, DLinehan, BXia, HPatel, MStudwell, DMiller, CHickey, ELevin, JISmith, DKemper, RAModis, LKBannen, LCChan, DSMac, MBNg, SWang, YXu, WLemieux, RM Late-stage optimization of a tercyclic class of S1P3-sparing, S1P1 receptor agonists. Bioorg Med Chem Lett26:466-71 (2016) 
 
Sphingosine 1-phosphate receptor 3
Name:Sphingosine 1-phosphate receptor 3
Type:G Protein-Coupled Receptor (GPCR)
Mol. Mass.:42278.13
Organism:Homo sapiens (Human)
Description:Q99500
Residue:378
BDBM50158336
NameBDBM50158336
Synonyms:2-(4-octylphenethyl)-2-aminopropane-1,3-diol 2-amino-2-(4-octylphenethyl)propane-1,3-diol CHEMBL314854 FINGOLIMOD HYDROCHLORIDE
TypeSmall organic molecule
Emp. Form.C19H33NO2
Mol. Mass.307.4708
SMILESCCCCCCCCc1ccc(CCC(N)(CO)CO)cc1