Reaction Details
TargetCoagulation factor XI
LigandBDBM50136575
Substrate/Competitorn/a
Meas. Tech.ChEMBL_1548350 (CHEMBL3756134)
Ki 0.360000±n/a nM
Citation Smith, LMOrwat, MJHu, ZHan, WWang, CRossi, KAGilligan, PJPabbisetty, KBOsuna, HCorte, JRRendina, ARLuettgen, JMWong, PCNarayanan, RHarper, TWBozarth, JMCrain, EJWei, ARamamurthy, VMorin, PEXin, BZheng, JSeiffert, DAQuan, MLLam, PYWexler, RRPinto, DJ Novel phenylalanine derived diamides as Factor XIa inhibitors. Bioorg Med Chem Lett26:472-8 (2016) 
 
Coagulation factor XI
Name:Coagulation factor XI
Type:Enzyme
Mol. Mass.:70130.58
Organism:Homo sapiens (Human)
Description:P03951
Residue:625
BDBM50136575
NameBDBM50136575
Synonyms:CHEMBL3752610
TypeSmall organic molecule
Emp. Form.C31H27ClFN7O5
Mol. Mass.632.041
SMILESCC1CC1C(=O)Nc1ccc(C[C@H](NC(=O)\C=C\c2c(F)c(Cl)ccc2-n2cnnn2)C(=O)Nc2ccc(cc2)C(O)=O)cc1