Reaction Details
TargetPlasma kallikrein
LigandBDBM50136581
Substrate/Competitorn/a
Meas. Tech.ChEMBL_1548351 (CHEMBL3756135)
Ki 24±n/a nM
Citation Smith, LMOrwat, MJHu, ZHan, WWang, CRossi, KAGilligan, PJPabbisetty, KBOsuna, HCorte, JRRendina, ARLuettgen, JMWong, PCNarayanan, RHarper, TWBozarth, JMCrain, EJWei, ARamamurthy, VMorin, PEXin, BZheng, JSeiffert, DAQuan, MLLam, PYWexler, RRPinto, DJ Novel phenylalanine derived diamides as Factor XIa inhibitors. Bioorg Med Chem Lett26:472-8 (2016) 
 
Plasma kallikrein
Name:Plasma kallikrein
Type:Protein
Mol. Mass.:71391.16
Organism:Homo sapiens (Human)
Description:P03952
Residue:638
BDBM50136581
NameBDBM50136581
Synonyms:CHEMBL3754635
TypeSmall organic molecule
Emp. Form.C26H22ClN9O2
Mol. Mass.527.965
SMILESNc1n[nH]c2cc(NC(=O)[C@H](Cc3ccccc3)NC(=O)\C=C\c3cc(Cl)ccc3-n3cnnn3)ccc12