Reaction Details
TargetCoagulation factor X
LigandBDBM50136573
Substrate/Competitorn/a
Meas. Tech.ChEMBL_1548359 (CHEMBL3756143)
Ki>9000±n/a nM
Citation Smith, LMOrwat, MJHu, ZHan, WWang, CRossi, KAGilligan, PJPabbisetty, KBOsuna, HCorte, JRRendina, ARLuettgen, JMWong, PCNarayanan, RHarper, TWBozarth, JMCrain, EJWei, ARamamurthy, VMorin, PEXin, BZheng, JSeiffert, DAQuan, MLLam, PYWexler, RRPinto, DJ Novel phenylalanine derived diamides as Factor XIa inhibitors. Bioorg Med Chem Lett26:472-8 (2016) 
 
Coagulation factor X
Name:Coagulation factor X
Type:Enzyme
Mol. Mass.:54726.60
Organism:Homo sapiens (Human)
Description:n/a
Residue:488
BDBM50136573
NameBDBM50136573
Synonyms:CHEMBL3752047
TypeSmall organic molecule
Emp. Form.C32H32ClN9O5
Mol. Mass.658.107
SMILESCN1CCN(CC1)C(=O)Nc1ccc(C[C@H](NC(=O)\C=C\c2cc(Cl)ccc2-n2cnnn2)C(=O)Nc2ccc(cc2)C(O)=O)cc1