Reaction Details
TargetPlasma kallikrein
LigandBDBM50136613
Substrate/Competitorn/a
Meas. Tech.ChEMBL_1548351 (CHEMBL3756135)
Ki 270±n/a nM
Citation Smith, LMOrwat, MJHu, ZHan, WWang, CRossi, KAGilligan, PJPabbisetty, KBOsuna, HCorte, JRRendina, ARLuettgen, JMWong, PCNarayanan, RHarper, TWBozarth, JMCrain, EJWei, ARamamurthy, VMorin, PEXin, BZheng, JSeiffert, DAQuan, MLLam, PYWexler, RRPinto, DJ Novel phenylalanine derived diamides as Factor XIa inhibitors. Bioorg Med Chem Lett26:472-8 (2016) 
 
Plasma kallikrein
Name:Plasma kallikrein
Type:Protein
Mol. Mass.:71391.16
Organism:Homo sapiens (Human)
Description:P03952
Residue:638
BDBM50136613
NameBDBM50136613
Synonyms:CHEMBL3753374
TypeSmall organic molecule
Emp. Form.C26H21ClN6O4
Mol. Mass.516.936
SMILESOC(=O)c1cccc(NC(=O)[C@H](Cc2ccccc2)NC(=O)\C=C\c2cc(Cl)ccc2-n2cnnn2)c1