Reaction Details
TargetPlasma kallikrein
LigandBDBM50136614
Substrate/Competitorn/a
Meas. Tech.ChEMBL_1548351 (CHEMBL3756135)
Ki 23±n/a nM
Citation Smith, LMOrwat, MJHu, ZHan, WWang, CRossi, KAGilligan, PJPabbisetty, KBOsuna, HCorte, JRRendina, ARLuettgen, JMWong, PCNarayanan, RHarper, TWBozarth, JMCrain, EJWei, ARamamurthy, VMorin, PEXin, BZheng, JSeiffert, DAQuan, MLLam, PYWexler, RRPinto, DJ Novel phenylalanine derived diamides as Factor XIa inhibitors. Bioorg Med Chem Lett26:472-8 (2016) 
 
Plasma kallikrein
Name:Plasma kallikrein
Type:Protein
Mol. Mass.:71391.16
Organism:Homo sapiens (Human)
Description:P03952
Residue:638
BDBM50136614
NameBDBM50136614
Synonyms:CHEMBL3753020
TypeSmall organic molecule
Emp. Form.C26H21ClN10O2
Mol. Mass.540.964
SMILESClc1ccc(c(\C=C\C(=O)N[C@@H](Cc2ccccc2)C(=O)Nc2ccc(cc2)-c2nnn[nH]2)c1)-n1cnnn1