Reaction Details
TargetKallikrein-1
LigandBDBM50136608
Substrate/Competitorn/a
Meas. Tech.ChEMBL_1548529 (CHEMBL3757186)
Ki>30000±n/a nM
Citation Smith, LMOrwat, MJHu, ZHan, WWang, CRossi, KAGilligan, PJPabbisetty, KBOsuna, HCorte, JRRendina, ARLuettgen, JMWong, PCNarayanan, RHarper, TWBozarth, JMCrain, EJWei, ARamamurthy, VMorin, PEXin, BZheng, JSeiffert, DAQuan, MLLam, PYWexler, RRPinto, DJ Novel phenylalanine derived diamides as Factor XIa inhibitors. Bioorg Med Chem Lett26:472-8 (2016) 
 
Kallikrein-1
Name:Kallikrein-1
Type:Enzyme
Mol. Mass.:28874.69
Organism:Homo sapiens (Human)
Description:P06870
Residue:262
BDBM50136608
NameBDBM50136608
Synonyms:CHEMBL3754069
TypeSmall organic molecule
Emp. Form.C26H21ClN6O4
Mol. Mass.516.936
SMILESOC(=O)c1ccc(NC(=O)[C@H](Cc2ccccc2)NC(=O)\C=C\c2cc(Cl)ccc2-n2cnnn2)cc1