Reaction Details
TargetPlasma kallikrein
LigandBDBM50136579
Substrate/Competitorn/a
Meas. Tech.ChEMBL_1548351 (CHEMBL3756135)
Ki 110±n/a nM
Citation Smith, LMOrwat, MJHu, ZHan, WWang, CRossi, KAGilligan, PJPabbisetty, KBOsuna, HCorte, JRRendina, ARLuettgen, JMWong, PCNarayanan, RHarper, TWBozarth, JMCrain, EJWei, ARamamurthy, VMorin, PEXin, BZheng, JSeiffert, DAQuan, MLLam, PYWexler, RRPinto, DJ Novel phenylalanine derived diamides as Factor XIa inhibitors. Bioorg Med Chem Lett26:472-8 (2016) 
 
Plasma kallikrein
Name:Plasma kallikrein
Type:Protein
Mol. Mass.:71391.16
Organism:Homo sapiens (Human)
Description:P03952
Residue:638
BDBM50136579
NameBDBM50136579
Synonyms:CHEMBL3754781
TypeSmall organic molecule
Emp. Form.C28H24ClN7O4
Mol. Mass.557.988
SMILESOc1cc(=O)[nH]c2ccc(cc12)C(=O)N[C@@H](Cc1ccccc1)C(=O)NCCc1cc(Cl)ccc1-n1cnnn1