Reaction Details
TargetCoagulation factor XI
LigandBDBM50136615
Substrate/Competitorn/a
Meas. Tech.ChEMBL_1548350 (CHEMBL3756134)
Ki 43±n/a nM
Citation Smith, LMOrwat, MJHu, ZHan, WWang, CRossi, KAGilligan, PJPabbisetty, KBOsuna, HCorte, JRRendina, ARLuettgen, JMWong, PCNarayanan, RHarper, TWBozarth, JMCrain, EJWei, ARamamurthy, VMorin, PEXin, BZheng, JSeiffert, DAQuan, MLLam, PYWexler, RRPinto, DJ Novel phenylalanine derived diamides as Factor XIa inhibitors. Bioorg Med Chem Lett26:472-8 (2016) 
 
Coagulation factor XI
Name:Coagulation factor XI
Type:Enzyme
Mol. Mass.:70130.58
Organism:Homo sapiens (Human)
Description:P03951
Residue:625
BDBM50136615
NameBDBM50136615
Synonyms:CHEMBL3751935
TypeSmall organic molecule
Emp. Form.C26H21ClN10O2
Mol. Mass.540.964
SMILESClc1ccc(c(\C=C\C(=O)N[C@@H](Cc2ccccc2)C(=O)Nc2ccc(cc2)-n2cnnn2)c1)-n1cnnn1