Reaction Details
TargetCoagulation factor XI
LigandBDBM50136582
Substrate/Competitorn/a
Meas. Tech.ChEMBL_1548350 (CHEMBL3756134)
Ki 11±n/a nM
Citation Smith, LMOrwat, MJHu, ZHan, WWang, CRossi, KAGilligan, PJPabbisetty, KBOsuna, HCorte, JRRendina, ARLuettgen, JMWong, PCNarayanan, RHarper, TWBozarth, JMCrain, EJWei, ARamamurthy, VMorin, PEXin, BZheng, JSeiffert, DAQuan, MLLam, PYWexler, RRPinto, DJ Novel phenylalanine derived diamides as Factor XIa inhibitors. Bioorg Med Chem Lett26:472-8 (2016) 
 
Coagulation factor XI
Name:Coagulation factor XI
Type:Enzyme
Mol. Mass.:70130.58
Organism:Homo sapiens (Human)
Description:P03951
Residue:625
BDBM50136582
NameBDBM50136582
Synonyms:CHEMBL3754712
TypeSmall organic molecule
Emp. Form.C28H22ClN7O4
Mol. Mass.555.972
SMILESOc1cc(=O)[nH]c2ccc(NC(=O)[C@H](Cc3ccccc3)NC(=O)\C=C\c3cc(Cl)ccc3-n3cnnn3)cc12